slate pencil-n
type: LexicalEntry
canonical form: slate pencil
sense: 04241869-n
part of speech: noun

04241869-n
type: LexicalConcept
in scheme: en-word.net
definition: a pencil of soft slate (or soapstone) used for writing on a slate
ili: i59043
lexfile: noun.artifact
part of speech: noun
hypernym: 03914323-n