skirt-n
type: LexicalEntry
canonical form: skirt
sense: 04237870-n
part of speech: noun

04237870-n
type: LexicalConcept
in scheme: en-word.net
definition: a garment hanging from the waist; worn mainly by girls and women
ili: i59017
lexfile: noun.artifact
part of speech: noun
hypernym: 03423924-n
mero part: 02889276-n
mero part: 03621300-n
mero part: 03960177-n
mero part: 04245427-n
mero part: 04362044-n
mero part: 08600819-n