sketch-n
type: LexicalEntry
canonical form: sketch
sense: 04234206-n
part of speech: noun

study-n
type: LexicalEntry
canonical form: study
sense: 04234206-n
part of speech: noun

04234206-n
type: LexicalConcept
in scheme: en-word.net
definition: preliminary drawing for later elaboration
example: he made several studies before starting to paint
ili: i58990
lexfile: noun.artifact
part of speech: noun
hypernym: 03239009-n