sieve-n
type: LexicalEntry
canonical form: sieve
sense: 04223701-n
part of speech: noun

screen-n
type: LexicalEntry
canonical form: screen
sense: 04223701-n
part of speech: noun

04223701-n
type: LexicalConcept
in scheme: en-word.net
definition: a strainer for separating lumps from powdered material or grading particles
ili: i58924
lexfile: noun.artifact
part of speech: noun
hypernym: 04339381-n