shroud-n
type: LexicalEntry
canonical form: shroud
sense: 04217790-n
part of speech: noun

04217790-n
type: LexicalConcept
in scheme: en-word.net
definition: a line that suspends the harness from the canopy of a parachute
ili: i58884
lexfile: noun.artifact
part of speech: noun
hypernym: 03676175-n