ship-n
type: LexicalEntry
canonical form: ship
sense: 04201332-n
part of speech: noun

04201332-n
type: LexicalConcept
in scheme: en-word.net
definition: a vessel that carries passengers or freight
ili: i58798
lexfile: noun.artifact
part of speech: noun
hypernym: 04537861-n
mero part: 02815920-n
mero part: 02841580-n
mero part: 02841812-n
mero part: 02919021-n
mero part: 02921714-n
mero part: 02968086-n
mero part: 03144649-n
mero part: 03169595-n
mero part: 03172332-n
mero part: 03345526-n
mero part: 03386950-n
mero part: 03408346-n
mero part: 03417130-n
mero part: 03478588-n
mero part: 03518055-n
mero part: 03691984-n
mero part: 03700275-n
mero part: 03992920-n
mero part: 04062973-n
mero part: 04096488-n
mero part: 04096634-n
mero part: 04161213-n
mero part: 04165518-n
mero part: 04195411-n
mero part: 04233599-n
mero part: 04274687-n
mero part: 04323784-n
mero part: 04365961-n
mero part: 04461811-n
mero part: 04463106-n
mero part: 04593031-n