sheet-n
type: LexicalEntry
canonical form: sheet
sense: 04195222-n
part of speech: noun

bed sheet-n
type: LexicalEntry
canonical form: bed sheet
sense: 04195222-n
part of speech: noun

04195222-n
type: LexicalConcept
in scheme: en-word.net
definition: bed linen consisting of a large rectangular piece of cotton or linen cloth; used in pairs
ili: i58764
lexfile: noun.artifact
part of speech: noun
hypernym: 02824165-n