server-n
type: LexicalEntry
canonical form: server
sense: 04182208-n
part of speech: noun

host-n
type: LexicalEntry
canonical form: host
sense: 04182208-n
part of speech: noun

04182208-n
type: LexicalConcept
in scheme: en-word.net
definition: (computer science) a computer that provides client stations with access to files and printers as shared resources to a computer network
ili: i58686
lexfile: noun.artifact
part of speech: noun
domain topic: 06138021-n
hypernym: 03086983-n