seat-n
type: LexicalEntry
canonical form: seat
sense: 04168419-n
part of speech: noun

04168419-n
type: LexicalConcept
in scheme: en-word.net
definition: any support where you can sit (especially the part of a chair or bench etc. on which you sit)
example: he dusted off the seat before sitting down
ili: i58608
lexfile: noun.artifact
part of speech: noun
hypernym: 04366676-n