screen-n
type: LexicalEntry
canonical form: screen
sense: 04159676-n
part of speech: noun

CRT screen-n
type: LexicalEntry
canonical form: CRT screen
sense: 04159676-n
part of speech: noun

04159676-n
type: LexicalConcept
in scheme: en-word.net
definition: the display that is electronically created on the surface of the large end of a cathode-ray tube
ili: i58557
lexfile: noun.artifact
part of speech: noun
hypernym: 03215838-n
mero part: 03387554-n