scale-n
type: LexicalEntry
canonical form: scale
sense: 04149040-n
part of speech: noun

weighing machine-n
type: LexicalEntry
canonical form: weighing machine
sense: 04149040-n
part of speech: noun

04149040-n
type: LexicalConcept
in scheme: en-word.net
definition: a measuring instrument for weighing; shows amount of mass
ili: i58495
lexfile: noun.artifact
part of speech: noun
hypernym: 03739416-n