salon-n
type: LexicalEntry
canonical form: salon
sense: 04138098-n
part of speech: noun

04138098-n
type: LexicalConcept
in scheme: en-word.net
definition: elegant sitting room where guests are received
ili: i58419
lexfile: noun.artifact
part of speech: noun
hypernym: 03685038-n