roof-n
type: LexicalEntry
canonical form: roof
sense: 04112162-n
part of speech: noun

04112162-n
type: LexicalConcept
in scheme: en-word.net
definition: a protective covering that covers or forms the top of a building
ili: i58260
lexfile: noun.artifact
part of speech: noun
hypernym: 04020673-n
mero part: 03267779-n
mero part: 04112885-n