road map-n
type: LexicalEntry
canonical form: road map
sense: 04104350-n
part of speech: noun

04104350-n
type: LexicalConcept
in scheme: en-word.net
definition: a map showing roads (for automobile travel)
ili: i58210
lexfile: noun.artifact
part of speech: noun
domain topic: 02961779-n
hypernym: 03725654-n