recording-n
type: LexicalEntry
canonical form: recording
sense: 04070773-n
part of speech: noun

04070773-n
type: LexicalConcept
in scheme: en-word.net
definition: a signal that encodes something (e.g., picture or sound) that has been recorded
ili: i58016
lexfile: noun.artifact
part of speech: noun
hypernym: 06804229-n