rear-n
type: LexicalEntry
canonical form: rear
sense: 04066813-n
part of speech: noun

back-n
type: LexicalEntry
canonical form: back
sense: 04066813-n
part of speech: noun

04066813-n
type: LexicalConcept
in scheme: en-word.net
definition: the side that goes last or is not normally seen
example: he wrote the date on the back of the photograph
ili: i57997
lexfile: noun.artifact
part of speech: noun
hypernym: 04220693-n