ramp-n
type: LexicalEntry
canonical form: ramp
sense: 04058661-n
part of speech: noun

incline-n
type: LexicalEntry
canonical form: incline
sense: 04058661-n
part of speech: noun

04058661-n
type: LexicalConcept
in scheme: en-word.net
definition: an inclined surface connecting two levels
ili: i57947
lexfile: noun.artifact
part of speech: noun
hypernym: 03571509-n