railing-n
type: LexicalEntry
canonical form: railing
sense: 04054513-n
part of speech: noun

rail-n
type: LexicalEntry
canonical form: rail
sense: 04054513-n
part of speech: noun

04054513-n
type: LexicalConcept
in scheme: en-word.net
definition: a barrier consisting of a horizontal bar and supports
ili: i57926
lexfile: noun.artifact
part of speech: noun
hypernym: 02799782-n
mero part: 03659301-n