racket-n
type: LexicalEntry
canonical form: racket
sense: 04045857-n
part of speech: noun

racquet-n
type: LexicalEntry
canonical form: racquet
sense: 04045857-n
part of speech: noun

04045857-n
type: LexicalConcept
in scheme: en-word.net
definition: a sports implement (usually consisting of a handle and an oval frame with a tightly interlaced network of strings) used to strike a ball (or shuttlecock) in various games
ili: i57882
lexfile: noun.artifact
part of speech: noun
hypernym: 04292760-n
mero part: 03318818-n
mero part: 03491080-n