rack-n
type: LexicalEntry
canonical form: rack
sense: 04045517-n
part of speech: noun

wheel-n
type: LexicalEntry
canonical form: wheel
sense: 04045517-n
part of speech: noun

04045517-n
type: LexicalConcept
in scheme: en-word.net
definition: an instrument of torture that stretches or disjoints or mutilates victims
ili: i57880
lexfile: noun.artifact
part of speech: noun
hypernym: 03581384-n