property-n
type: LexicalEntry
canonical form: property
sense: 04018636-n
part of speech: noun

prop-n
type: LexicalEntry
canonical form: prop
sense: 04018636-n
part of speech: noun

04018636-n
type: LexicalConcept
in scheme: en-word.net
definition: any movable articles or objects used on the set of a play or movie
example: before every scene he ran down his checklist of props
ili: i57719
lexfile: noun.artifact
part of speech: noun
hypernym: 00002684-n