prop-n
type: LexicalEntry
canonical form: prop
sense: 04017618-n
part of speech: noun

04017618-n
type: LexicalConcept
in scheme: en-word.net
definition: a support placed beneath or against something to keep it from shaking or falling
ili: i57714
lexfile: noun.artifact
part of speech: noun
hypernym: 04367588-n