printer-n
type: LexicalEntry
canonical form: printer
sense: 04011143-n
part of speech: noun

04011143-n
type: LexicalConcept
in scheme: en-word.net
definition: (computer science) an output device that prints the results of data processing
ili: i57680
lexfile: noun.artifact
part of speech: noun
domain topic: 06138021-n
hypernym: 03922839-n
hypernym: 04010851-n