print-n
type: LexicalEntry
canonical form: print
sense: 04010358-n
part of speech: noun

04010358-n
type: LexicalConcept
in scheme: en-word.net
definition: a copy of a movie on film (especially a particular version of it)
ili: i57676
lexfile: noun.artifact
part of speech: noun
hypernym: 03109245-n