powder-n
type: LexicalEntry
canonical form: powder
sense: 04000366-n
part of speech: noun

04000366-n
type: LexicalConcept
in scheme: en-word.net
definition: any of various cosmetic or medical preparations dispensed in the form of a pulverized powder
ili: i57616
lexfile: noun.artifact
part of speech: noun
hypernym: 04454577-n
hypernym: 03745652-n