porch-n
type: LexicalEntry
canonical form: porch
sense: 03990739-n
part of speech: noun

03990739-n
type: LexicalConcept
in scheme: en-word.net
definition: a structure attached to the exterior of a building often forming a covered entrance
ili: i57556
lexfile: noun.artifact
part of speech: noun
hypernym: 04348764-n