pole-n
type: LexicalEntry
canonical form: pole
sense: 03983516-n
part of speech: noun

03983516-n
type: LexicalConcept
in scheme: en-word.net
definition: a long fiberglass sports implement used for pole vaulting
ili: i57507
lexfile: noun.artifact
part of speech: noun
hypernym: 04292760-n