pit-n
type: LexicalEntry
canonical form: pit
sense: 03956037-n
part of speech: noun

03956037-n
type: LexicalConcept
in scheme: en-word.net
definition: (auto racing) an area at the side of a racetrack where the race cars are serviced and refueled
ili: i57359
lexfile: noun.artifact
part of speech: noun
domain topic: 00450502-n
hypernym: 02738693-n