piece-n
type: LexicalEntry
canonical form: piece
sense: 03938737-n
part of speech: noun

part-n
type: LexicalEntry
canonical form: part
sense: 03938737-n
part of speech: noun

03938737-n
type: LexicalConcept
in scheme: en-word.net
definition: an item that is an instance of some type
example: he designed a new piece of equipment
example: she bought a lovely piece of china
example: my dog swallowed a Lego part
ili: i57250
lexfile: noun.artifact
part of speech: noun
hypernym: 03593583-n