perch-n
type: LexicalEntry
canonical form: perch
sense: 03921038-n
part of speech: noun

03921038-n
type: LexicalConcept
in scheme: en-word.net
definition: support consisting of a branch or rod that serves as a resting place (especially for a bird)
ili: i57151
lexfile: noun.artifact
part of speech: noun
hypernym: 04366676-n