painting-n
type: LexicalEntry
canonical form: painting
sense: 03882197-n
part of speech: noun

picture-n
type: LexicalEntry
canonical form: picture
sense: 03882197-n
part of speech: noun

03882197-n
type: LexicalConcept
in scheme: en-word.net
definition: graphic art consisting of an artistic composition made by applying paints to a surface
example: a small painting by Picasso
example: he bought the painting as an investment
example: his pictures hang in the Louvre
ili: i56911
lexfile: noun.artifact
part of speech: noun
hypernym: 03458753-n