oilskin-n
type: LexicalEntry
canonical form: oilskin
sense: 03850335-n
part of speech: noun

slicker-n
type: LexicalEntry
canonical form: slicker
sense: 03850335-n
part of speech: noun

03850335-n
type: LexicalConcept
in scheme: en-word.net
definition: a macintosh made from cotton fabric treated with oil and pigment to make it waterproof
ili: i56719
lexfile: noun.artifact
part of speech: noun
hypernym: 03708258-n