obstacle-n
type: LexicalEntry
canonical form: obstacle
sense: 03845315-n
part of speech: noun

03845315-n
type: LexicalConcept
in scheme: en-word.net
definition: an obstruction that stands in the way (and must be removed or surmounted or circumvented)
ili: i56687
lexfile: noun.artifact
part of speech: noun
hypernym: 03845513-n