novel-n
type: LexicalEntry
canonical form: novel
sense: 03838605-n
part of speech: noun

03838605-n
type: LexicalConcept
in scheme: en-word.net
definition: a printed and bound book that is an extended work of fiction
example: his bookcases were filled with nothing but novels
example: he burned all the novels
ili: i56647
lexfile: noun.artifact
part of speech: noun
hypernym: 02873453-n