newspaper-n
type: LexicalEntry
canonical form: newspaper
sense: 03827711-n
part of speech: noun

paper-n
type: LexicalEntry
canonical form: paper
sense: 03827711-n
part of speech: noun

03827711-n
type: LexicalConcept
in scheme: en-word.net
definition: the physical object that is the product of a newspaper publisher
example: when it began to rain he covered his head with a newspaper
ili: i56582
lexfile: noun.artifact
part of speech: noun
hypernym: 04014270-n