network-n
type: LexicalEntry
canonical form: network
sense: 03826014-n
part of speech: noun

03826014-n
type: LexicalConcept
in scheme: en-word.net
definition: (broadcasting) a communication system consisting of a group of broadcasting stations that all transmit the same programs
example: the networks compete to broadcast important sports events
ili: i56572
lexfile: noun.artifact
part of speech: noun
domain topic: 06287350-n
hypernym: 03081962-n