net-n
type: LexicalEntry
canonical form: net
sense: 03825534-n
part of speech: noun

03825534-n
type: LexicalConcept
in scheme: en-word.net
definition: a trap made of netting to catch fish or birds or insects
ili: i56569
lexfile: noun.artifact
part of speech: noun
hypernym: 04481701-n