mirror-n
type: LexicalEntry
canonical form: mirror
sense: 03778568-n
part of speech: noun

03778568-n
type: LexicalConcept
in scheme: en-word.net
definition: polished surface that forms images by reflecting light
ili: i56291
lexfile: noun.artifact
part of speech: noun
hypernym: 04076388-n