miniature-n
type: LexicalEntry
canonical form: miniature
sense: 03774770-n
part of speech: noun

toy-n
type: LexicalEntry
canonical form: toy
sense: 03774770-n
part of speech: noun

03774770-n
type: LexicalConcept
in scheme: en-word.net
definition: a copy that reproduces a person or thing in greatly reduced size
ili: i56267
lexfile: noun.artifact
part of speech: noun
hypernym: 03109245-n