material-n
type: LexicalEntry
canonical form: material
sense: 03735442-n
part of speech: noun

03735442-n
type: LexicalConcept
in scheme: en-word.net
definition: things needed for doing or making something
example: writing materials
example: useful teaching materials
ili: i56073
lexfile: noun.artifact
part of speech: noun
hypernym: 03298959-n