masher-n
type: LexicalEntry
canonical form: masher
sense: 03729908-n
part of speech: noun

03729908-n
type: LexicalConcept
in scheme: en-word.net
definition: a kitchen utensil used for mashing (e.g. potatoes)
ili: i56036
lexfile: noun.artifact
part of speech: noun
hypernym: 03626258-n