mallet-n
type: LexicalEntry
canonical form: mallet
sense: 03720925-n
part of speech: noun

beetle-n
type: LexicalEntry
canonical form: beetle
sense: 03720925-n
part of speech: noun

03720925-n
type: LexicalConcept
in scheme: en-word.net
definition: a tool resembling a hammer but with a large head (usually wooden); used to drive wedges or ram down paving stones or for crushing or beating or flattening or smoothing
ili: i55976
lexfile: noun.artifact
part of speech: noun
hypernym: 03486255-n