mail-n
type: LexicalEntry
canonical form: mail
sense: 03715183-n
part of speech: noun

03715183-n
type: LexicalConcept
in scheme: en-word.net
definition: a conveyance that transports the letters and packages that are conveyed by the postal system
ili: i55937
lexfile: noun.artifact
part of speech: noun
hypernym: 03105141-n