machine-n
type: LexicalEntry
canonical form: machine
sense: 03706297-n
part of speech: noun

simple machine-n
type: LexicalEntry
canonical form: simple machine
sense: 03706297-n
part of speech: noun

03706297-n
type: LexicalConcept
in scheme: en-word.net
definition: a device for overcoming resistance at one point by applying force at some other point
ili: i55889
lexfile: noun.artifact
part of speech: noun
hypernym: 03742461-n