loving cup-n
type: LexicalEntry
canonical form: loving cup
sense: 03699033-n
part of speech: noun

03699033-n
type: LexicalConcept
in scheme: en-word.net
definition: a large drinking vessel (usually with two handles) that people drink out of in turn at a banquet
ili: i55846
lexfile: noun.artifact
part of speech: noun
hypernym: 03246199-n