loft-n
type: LexicalEntry
canonical form: loft
sense: 03691689-n
part of speech: noun

pigeon loft-n
type: LexicalEntry
canonical form: pigeon loft
sense: 03691689-n
part of speech: noun

03691689-n
type: LexicalConcept
in scheme: en-word.net
definition: a raised shelter in which pigeons are kept
ili: i55796
lexfile: noun.artifact
part of speech: noun
hypernym: 04198638-n