lodge-n
type: LexicalEntry
canonical form: lodge
sense: 03690966-n
part of speech: noun

03690966-n
type: LexicalConcept
in scheme: en-word.net
definition: small house at the entrance to the grounds of a country mansion; usually occupied by a gatekeeper or gardener
ili: i55792
lexfile: noun.artifact
part of speech: noun
domain region: 08879115-n
hypernym: 03433000-n