lodge-n
type: LexicalEntry
canonical form: lodge
sense: 03690812-n
part of speech: noun

hunting lodge-n
type: LexicalEntry
canonical form: hunting lodge
sense: 03690812-n
part of speech: noun

03690812-n
type: LexicalConcept
in scheme: en-word.net
definition: a small (rustic) house used as a temporary shelter
ili: i55791
lexfile: noun.artifact
part of speech: noun
hypernym: 03549540-n