linchpin-n
type: LexicalEntry
canonical form: linchpin
sense: 03675665-n
part of speech: noun

lynchpin-n
type: LexicalEntry
canonical form: lynchpin
sense: 03675665-n
part of speech: noun

03675665-n
type: LexicalConcept
in scheme: en-word.net
definition: pin inserted through an axletree to hold a wheel on
ili: i55705
lexfile: noun.artifact
part of speech: noun
hypernym: 03946532-n