level-n
type: LexicalEntry
canonical form: level
sense: 03664184-n
part of speech: noun

spirit level-n
type: LexicalEntry
canonical form: spirit level
sense: 03664184-n
part of speech: noun

03664184-n
type: LexicalConcept
in scheme: en-word.net
definition: indicator that establishes the horizontal when a bubble is centered in a tube of liquid
ili: i55640
lexfile: noun.artifact
part of speech: noun
hypernym: 03573297-n